[Linux] can't compile - *** [Textures.xbt] Error 1

  Thread Rating:
  • 0 Votes - 0 Average
  • 1
  • 2
  • 3
  • 4
  • 5
Post Reply
amnon82 Offline
Junior Member
Posts: 1
Joined: Jun 2010
Reputation: 0
Exclamation  [Linux] can't compile - *** [Textures.xbt] Error 1
Post: #1
I try to build xbmc 9.11 for Chakra GNU/Linux a new distro I started with some friends. Now I get this:

Code:
make[1]: Leaving directory `/home/phil/buildroot/apps-testing/xbmc/src/xbmc-9.11/xbmc/screensavers/rsxs-0.9/xbmc'
make -C skin/Confluence/media
g++ -MD -c -march=i686 -mtune=generic -O2 -pipe -O2 -march=i686 -mtune=generic -O2 -pipe -O2 -DNDEBUG=1 -march=i686 -mtune=generic -O2 -pipe -O2 -DNDEBUG=1 -D_LINUX -D_FILE_DEFINED -D_REENTRANT -D_LARGEFILE64_SOURCE -D_FILE_OFFSET_BITS=64 -DINSTALL_PATH="\"/usr/share/xbmc\"" -DHAS_SDL_JOYSTICK -D'SVN_REV="-CHAKRA"' -DHAVE_CONFIG_H  -I. -I.. -I../../ -I../linux -I../cores -I../../guilib -I/home/phil/buildroot/apps-testing/xbmc/src/xbmc-9.11     -I/usr/include/fribidi     -I/usr/include/libpng14         -I/usr/include/ -I/usr/include/glib-2.0 -I/usr/lib/glib-2.0/include   -I/usr/include/freetype2       -I/usr/include/alsa               -I/usr/include/dbus-1.0 -I/usr/lib/dbus-1.0/include   -DDBUS_API_SUBJECT_TO_CHANGE -I/usr/include/hal -I/usr/include/dbus-1.0 -I/usr/lib/dbus-1.0/include   -D_GNU_SOURCE=1 -D_REENTRANT -I/usr/include/SDL   -DDBUS_API_SUBJECT_TO_CHANGE -I/usr/include/hal -I/usr/include/dbus-1.0 -I/usr/lib/dbus-1.0/include   -I/usr/include/lzo Socket.cpp -o Socket.o
make[1]: Entering directory `/home/phil/buildroot/apps-testing/xbmc/src/xbmc-9.11/skin/Confluence/media'
make -C ../../../tools/TexturePacker
make[2]: Entering directory `/home/phil/buildroot/apps-testing/xbmc/src/xbmc-9.11/tools/TexturePacker'
make[2]: Nothing to be done for `all'.
make[2]: Leaving directory `/home/phil/buildroot/apps-testing/xbmc/src/xbmc-9.11/tools/TexturePacker'
../../../tools/TexturePacker/TexturePacker -input . -output Textures.xbt
make[1]: *** [Textures.xbt] Error 1
make[1]: Leaving directory `/home/phil/buildroot/apps-testing/xbmc/src/xbmc-9.11/skin/Confluence/media'
make: *** [skins] Error 2
make: *** Waiting for unfinished jobs....

Full build log you can find here: http://pastebin.com/cawJTekh

I updated gcc 4.5 to a newer snapshot but that didn't helped. What do I still miss here?

My files are here:

http://konnektion.ath.cx/svn/packages/ap...ting/xbmc/
http://konnektion.ath.cx/svn/packages/ap.../xbmc-svn/

And my system is:

CPU data:
--------------------------------------------------------------------------------
processor : 1
vendor_id : AuthenticAMD
cpu family : 15
model : 107
model name : AMD Athlon™ 64 X2 Dual Core Processor 4800+
stepping : 1
cpu MHz : 2500.000
cache size : 512 KB
physical id : 0
siblings : 2
core id : 1
cpu cores : 2
apicid : 1
initial apicid : 1
fdiv_bug : no
hlt_bug : no
f00f_bug : no
coma_bug : no
fpu : yes
fpu_exception : yes
cpuid level : 1
wp : yes
flags : fpu vme de pse tsc msr pae mce cx8 apic sep mtrr pge mca cmov pat pse36 clflush mmx fxsr sse sse2 ht syscall nx mmxext fxsr_opt rdtscp lm 3dnowext 3dnow extd_apicid pni cx16 lahf_lm cmp_legacy svm extapic cr8_legacy 3dnowprefetch
bogomips : 5024.19
clflush size : 64
cache_alignment : 64
address sizes : 40 bits physical, 48 bits virtual
power management: ts fid vid ttp tm stc 100mhzsteps
(This post was last modified: 2010-06-07 23:58 by amnon82.)
find quote